|
Last change
on this file since 232 was 232, checked in by alain, 14 years ago |
|
Introducing the elementary tests for a TSAR mono-cluster
mono-processor platform with MMU using the vci_cc_vcache_v4
such as the "tsarv4_mono_mmu".
(assemby level tests written by Manuel Bouyer)
|
|
File size:
1.4 KB
|
| Line | |
|---|
| 1 | -n test_sanity:
|
|---|
| 2 | -n test_exceptions:
|
|---|
| 3 | -n test_mmu_basic:
|
|---|
| 4 | test FAILED
|
|---|
| 5 | -n test_excep_ls:
|
|---|
| 6 | test FAILED
|
|---|
| 7 | -n test_excep_ls_delayslot:
|
|---|
| 8 | -n test_excep_ls_llsc:
|
|---|
| 9 | test FAILED
|
|---|
| 10 | -n test_excep_if:
|
|---|
| 11 | test FAILED
|
|---|
| 12 | -n test_excep_if_delayslot:
|
|---|
| 13 | test FAILED
|
|---|
| 14 | -n test_excep_if_llsc:
|
|---|
| 15 | test FAILED
|
|---|
| 16 | -n test_exception_epc_modify:
|
|---|
| 17 | -n test_dtlb_inval:
|
|---|
| 18 | -n test_dtlb_inval2:
|
|---|
| 19 | test FAILED
|
|---|
| 20 | -n test_dtlb_inval3:
|
|---|
| 21 | test FAILED
|
|---|
| 22 | -n test_itlb_inval:
|
|---|
| 23 | -n test_itlb_inval2:
|
|---|
| 24 | test FAILED
|
|---|
| 25 | -n test_idtlb_inval:
|
|---|
| 26 | test FAILED
|
|---|
| 27 | -n test_idtlb_inval2:
|
|---|
| 28 | test FAILED
|
|---|
| 29 | -n test_idtlb_inval3:
|
|---|
| 30 | test FAILED
|
|---|
| 31 | -n test_idtlb_inval4:
|
|---|
| 32 | test FAILED
|
|---|
| 33 | -n test_dtlb_ptprinval:
|
|---|
| 34 | -n test_itlb_ptprinval:
|
|---|
| 35 | -n test_idtlb_ptprinval:
|
|---|
| 36 | test FAILED
|
|---|
| 37 | -n test_sync:
|
|---|
| 38 | -n test_sc_update_cache:
|
|---|
| 39 | -n test_pte_llsc:
|
|---|
| 40 | test FAILED
|
|---|
| 41 | -n test_interrupt:
|
|---|
| 42 | -n test_interrupt_epc_modify:
|
|---|
| 43 | -n test_xicu_timer:
|
|---|
| 44 | -n test_interrupt_delayslot:
|
|---|
| 45 | test FAILED
|
|---|
| 46 | -n test_interrupt_mask:
|
|---|
| 47 | -n test_interrupt_external_mask:
|
|---|
| 48 | -n test_excep_cop:
|
|---|
| 49 | -n test_excep_cop_delayslot:
|
|---|
| 50 | -n test_excep_cop1:
|
|---|
| 51 | -n test_syscall:
|
|---|
| 52 | -n test_syscall_delayslot:
|
|---|
| 53 | -n test_breakpoint:
|
|---|
| 54 | -n test_breakpoint_delayslot:
|
|---|
| 55 | -n test_ri:
|
|---|
| 56 | -n test_ri_delayslot:
|
|---|
| 57 | -n test_ao:
|
|---|
| 58 | -n test_ao_delayslot:
|
|---|
| 59 | -n test_trap:
|
|---|
| 60 | -n test_trap_delayslot:
|
|---|
| 61 | -n test_fpe:
|
|---|
| 62 | -n test_fpe_delayslot:
|
|---|
| 63 | test FAILED
|
|---|
| 64 | -n test_dcache_inval_pa:
|
|---|
| 65 | test FAILED
|
|---|
| 66 | -n test_icache_inval_pa:
|
|---|
| 67 | test FAILED
|
|---|
| 68 | -n test_pte2i_ref:
|
|---|
| 69 | -n test_pte2lw_ref:
|
|---|
| 70 | -n test_pte2ll_ref:
|
|---|
| 71 | -n test_pte2sw_dirty:
|
|---|
| 72 | -n test_pte2sc_dirty:
|
|---|
Note:
See
TracBrowser
for help on using the repository browser.